{"text_format":"1","workbook":"xlsx","n_sheets":5,"sheets":["Fragen","Berechnung","Ergebnisse","Gesamtauswertung","Modulrelevanz"],"not_rendered":{"charts":1,"images":1,"macros":1,"external_links":0,"defined_names":0,"comments":0,"pivot_tables":0},"unopened":[],"bounds":{"document_bytes":16777216,"sheet_cells":100000,"rows_first":2000,"rows_last":500,"rows_between":2000,"halvings":0,"cell_chars":16384,"cell_head_chars":4096},"cells_cut":0,"cells_raw":0,"read":"whole","date_system":"1900"}

{"sheet":"Fragen","index":0,"n_rows":53,"n_cols":10,"rows_kept":53,"cut":false,"hidden":false,"merged":[[45,4,45,8],[48,4,48,8],[51,4,51,8],[36,4,36,8],[39,4,39,8],[42,4,42,8],[24,4,24,8],[27,4,27,8],[30,4,30,8],[33,4,33,8],[9,4,9,8],[12,4,12,8],[15,4,15,8],[18,4,18,8],[21,4,21,8]]}
[]
[]
[]
[]
[]
[]
[]
[null,null,null,null,null,null,null,null,null,"Version 5 vom 26.02.2019"]
[]
[null,null,null,"Frage 1","Meinen Arbeitsplatz stelle ich mir"]
[1,null,null,"flexibel und unterwegs vor",{"$f":"IF($B11=1,1,\"\")","v":""},{"$f":"IF($B11=2,2,\"\")","v":""},{"$f":"IF($B11=3,3,\"\")","v":""},{"$f":"IF($B11=4,4,\"\")","v":""},{"$f":"IF($B11=5,5,\"\")","v":""},"an einem Ort vor"]
[2]
[3,null,null,"Frage 2","Am liebsten arbeite ich"]
[4,null,null,"draußen an der frischen Luft",{"$f":"IF($B14=1,1,\"\")","v":""},{"$f":"IF($B14=2,2,\"\")","v":""},{"$f":"IF($B14=3,3,\"\")","v":""},{"$f":"IF($B14=4,4,\"\")","v":""},{"$f":"IF($B14=5,5,\"\")","v":""},"in temperierter Umgebung"]
[5]
[null,null,null,"Frage 3","Andere zu motivieren fällt mir"]
[null,null,null,"in der Regel leicht",{"$f":"IF($B17=1,1,\"\")","v":""},{"$f":"IF($B17=2,2,\"\")","v":""},{"$f":"IF($B17=3,3,\"\")","v":""},{"$f":"IF($B17=4,4,\"\")","v":""},{"$f":"IF($B17=5,5,\"\")","v":""},"wirklich schwer"]
[]
[1,null,null,"Frage 4","Anweisungen im Beruf"]
[2,null,null,"möchte ich selbst geben",{"$f":"IF($B20=1,1,\"\")","v":""},{"$f":"IF($B20=2,2,\"\")","v":""},{"$f":"IF($B20=3,3,\"\")","v":""},{"$f":"IF($B20=4,4,\"\")","v":""},{"$f":"IF($B20=5,5,\"\")","v":""},"hätte ich gerne von Anderen"]
[3]
[4,null,null,"Frage 5","Meine Arbeitsweise passt mehr zu "]
[5,null,null,"gemeinsamer Teamarbeit",{"$f":"IF($B23=1,1,\"\")","v":""},{"$f":"IF($B23=2,2,\"\")","v":""},{"$f":"IF($B23=3,3,\"\")","v":""},{"$f":"IF($B23=4,4,\"\")","v":""},{"$f":"IF($B23=5,5,\"\")","v":""},"Einzelarbeit"]
[3]
[4,null,null,"Frage 6","Bei der Umsetzung von Projekten"]
[5,null,null,"plane ich Lösungen",{"$f":"IF($B26=1,1,\"\")","v":""},{"$f":"IF($B26=2,2,\"\")","v":""},{"$f":"IF($B26=3,3,\"\")","v":""},{"$f":"IF($B26=4,4,\"\")","v":""},{"$f":"IF($B26=5,5,\"\")","v":""},"realisiere ich Lösungen "]
[3]
[4,null,null,"Frage 7","Meine Interessenausrichtung ist überwiegend"]
[5,null,null,"technisch",{"$f":"IF($B29=1,1,\"\")","v":""},{"$f":"IF($B29=2,2,\"\")","v":""},{"$f":"IF($B29=3,3,\"\")","v":""},{"$f":"IF($B29=4,4,\"\")","v":""},{"$f":"IF($B29=5,5,\"\")","v":""},"wirtschaftlich"]
[3]
[4,null,null,"Frage 8","Ich begeistere mich eher für"]
[5,null,null,"Tiefbau",{"$f":"IF($B32=1,1,\"\")","v":""},{"$f":"IF($B32=2,2,\"\")","v":""},{"$f":"IF($B32=3,3,\"\")","v":""},{"$f":"IF($B32=4,4,\"\")","v":""},{"$f":"IF($B32=5,5,\"\")","v":""},"Hochbau oder Ausbau"]
[3]
[4,null,null,"Frage 9","Dinge kann ich mir gut vorstellen, wenn"]
[5,null,null,"ich Sie im Kopf durchdenke",{"$f":"IF($B35=1,1,\"\")","v":""},{"$f":"IF($B35=2,2,\"\")","v":""},{"$f":"IF($B35=3,3,\"\")","v":""},{"$f":"IF($B35=4,4,\"\")","v":""},{"$f":"IF($B35=5,5,\"\")","v":""},"ich sie real vor Augen habe"]
[3]
[4,null,null,"Frage 10","Ich konzentriere mich lieber auf"]
[5,null,null,"ein Vorhaben intensiv",{"$f":"IF($B38=1,1,\"\")","v":""},{"$f":"IF($B38=2,2,\"\")","v":""},{"$f":"IF($B38=3,3,\"\")","v":""},{"$f":"IF($B38=4,4,\"\")","v":""},{"$f":"IF($B38=5,5,\"\")","v":""},"mehrere Vorhaben gleichzeitig"]
[3]
[4,null,null,"Frage 11","Arbeitszeiten stelle ich mir"]
[5,null,null,"eher flexibel und individuell vor",{"$f":"IF($B41=1,1,\"\")","v":""},{"$f":"IF($B41=2,2,\"\")","v":""},{"$f":"IF($B41=3,3,\"\")","v":""},{"$f":"IF($B41=4,4,\"\")","v":""},{"$f":"IF($B41=5,5,\"\")","v":""},"eher geregelt und fest vor"]
[3]
[4,null,null,"Frage 12","Ich analysiere Probleme eher"]
[5,null,null,"im Gesamtkontext",{"$f":"IF($B44=1,1,\"\")","v":""},{"$f":"IF($B44=2,2,\"\")","v":""},{"$f":"IF($B44=3,3,\"\")","v":""},{"$f":"IF($B44=4,4,\"\")","v":""},{"$f":"IF($B44=5,5,\"\")","v":""},"in Einzelheiten und Details"]
[3]
[4,null,null,"Frage 13","Lösungsansätze für plötzliche Probleme"]
[5,null,null,"plane ich bestmöglich im Vorfeld",{"$f":"IF($B47=1,1,\"\")","v":""},{"$f":"IF($B47=2,2,\"\")","v":""},{"$f":"IF($B47=3,3,\"\")","v":""},{"$f":"IF($B47=4,4,\"\")","v":""},{"$f":"IF($B47=5,5,\"\")","v":""},"schaffe ich meist spontan"]
[3]
[4,null,null,"Frage 14","Für Veränderungen bin ich bereit"]
[5,null,null,"nur wenn sie notwendig sind",{"$f":"IF($B50=1,1,\"\")","v":""},{"$f":"IF($B50=2,2,\"\")","v":""},{"$f":"IF($B50=3,3,\"\")","v":""},{"$f":"IF($B50=4,4,\"\")","v":""},{"$f":"IF($B50=5,5,\"\")","v":""},"wenn ich damit etwas verbessere"]
[3]
[4,null,null,"Frage 15","Bei Konflikten bin ich eher"]
[5,null,null,"kompromissbereit",{"$f":"IF($B53=1,1,\"\")","v":""},{"$f":"IF($B53=2,2,\"\")","v":""},{"$f":"IF($B53=3,3,\"\")","v":""},{"$f":"IF($B53=4,4,\"\")","v":""},{"$f":"IF($B53=5,5,\"\")","v":""},"klar und stark positioniert"]

{"sheet":"Berechnung","index":1,"n_rows":44,"n_cols":62,"rows_kept":44,"cut":false,"hidden":true,"merged":[]}
["Positionen \nder Berufe","Sachbearbeitung Bauordnungsamt","Stadtplanung","Denkmalpflege","Kostenplanung","Termin- und Kapazitätsplanung","Ausschreibung und Vergabe","Sicherheits- und Gesundheitskoordination (SiGeKo)","Vermessung","Allg. Genehmigungsplanung","Statik und Prüfstatik","Stahlbau","Spannbetonbau","Holzbau","Glas-/Aluminiumbau","Bauüberwachung","Sachverständigenwesen","Prüfstatiker","Brandschutzplanung","Bauphysikalische Planung","Energieberatung","Baudynamik","Geotechnik","Wasserbau","Gleis- und Bahnbau","Brückenbau","Tunnelbau","Technische Gebäudeausrüstung (TGA)","Beleuchtungsplanung","Bauindustrie - Forschung + Entwicklung","Bauindustrie - Herstellung","Bauindustrie - Techn. Außendienst","Projektentwicklung","Projektsteuerung","Bauwirtschaft - Kalkulation","Bauwirtschaft - Bauleitung (Hochbau)","Bauwirtschaft - Bauleitung (Tiefbau)","Stahlbetonbau","Straßenbau","Infrastrukturmanagement","Lehre in der Berufsbildung","Wissenschaftliche Assistenz","Softwareentwicklung im Baubereich",null,null,null,null,null,null,null,null,"Antworten",null,null,null,"Rang","Anzeige",null,null,null,"Abweichung","Übereinstimmung: \n100% sind 0 Abweichung, \n0% sind 18*3 (54) Abweichung"]
["Frage 1",5,4,3,4,4,5,2,2,4,3,3,4,4,3,1,2,3,2,3,3,2,3,3,4,4,3,4,4,5,5,1,4,2,5,1,1,3,2,3,4,4,5,null,null,null,null,null,null,null,null,{"$f":"Fragen!B11","v":0},null,null,null,{"$f":"SMALL(B$41:AQ$41,ROW(BD2)-1)","v":1},{"$f":"SMALL(B$43:AQ$43,ROW(BE2)-1)","v":1},{"$f":"HLOOKUP(BE2,B$43:AQ$44,2,FALSE)","v":"Geotechnik"},null,null,{"$f":"HLOOKUP(BF2,B$1:AQ$40,40,FALSE)","v":32.960241340367574},{"$f":"(1-BI2/$BA$41)*100","v":27.528053341320202}]
["Frage 2",5,4,2,5,5,5,3,3,5,4,4,4,4,3,2,3,4,4,4,4,3,2,2,3,4,3,4,5,5,4,3,4,3,5,3,2,4,3,4,5,5,5,null,null,null,null,null,null,null,null,{"$f":"Fragen!B14","v":0},null,null,null,2,2,"Straßenbau",null,null,36.39623725777254,{"$f":"(1-BI3/$BA$41)*100","v":19.973093100763993}]
["Frage 3",3,2,3,2,3,4,1,3,2,3,2,2,2,2,4,2,4,3,3,2,3,3,3,2,3,3,3,3,4,2,1,2,2,4,1,1,4,3,3,1,1,2,null,null,null,null,null,null,null,null,{"$f":"Fragen!B17","v":0},null,null,null,3,3,"Wasserbau",null,null,39.216773938548755,13.771385359391486]
["Frage 4",2,2,4,2,2,2,1,2,1,1,2,2,2,3,2,2,1,2,2,3,3,2,2,3,2,2,2,4,3,1,2,2,1,2,1,1,2,2,3,2,2,4,null,null,null,null,null,null,null,null,{"$f":"Fragen!B20","v":0},null,null,null,4,4,"Tunnelbau",null,null,39.509315494768508,13.128154145187986]
["Frage 5",3,3,2,4,3,3,5,4,3,4,3,3,3,3,4,5,5,2,3,4,3,2,3,2,2,3,3,4,2,2,4,2,1,4,3,3,4,4,3,4,4,5,null,null,null,null,null,null,null,null,{"$f":"Fragen!B23","v":0},null,null,null,5,5,"Baudynamik",null,null,40.931594825314988,10.000890885411206]
[null,null,null,null,null,null,null,null,null,null,null,null,null,null,null,null,null,null,null,null,null,null,null,null,null,null,null,null,null,null,null,null,null,null,null,null,null,null,null,null,null,null,null,null,null,null,null,null,null,null,null,null,null,null,null,6,6,"Brückenbau",null,null,41.481176237903362,8.7924884830620993]
["Frage 6",4,1,4,2,2,1,5,3,1,1,1,1,1,2,3,3,1,2,1,3,2,1,1,1,1,1,1,1,1,5,5,3,5,1,5,5,2,2,4,3,2,5,null,null,null,null,null,null,null,null,{"$f":"Fragen!B26","v":0},null,null,null,7,7,"Gleis- und Bahnbau",null,null,41.553897777987864,8.6325906376696118]
["Frage 7",2,3,2,5,4,5,2,2,1,1,1,3,3,2,2,1,1,2,2,3,1,2,3,3,3,2,3,1,2,4,3,5,5,5,4,4,1,2,3,2,2,1,null,null,null,null,null,null,null,null,{"$f":"Fragen!B29","v":0},null,null,null,8,8,"Statik und Prüfstatik",null,null,42.526131932274126,6.4948726203295504]
["Frage 8",3,2,4,3,3,3,3,3,3,3,4,3,4,4,3,3,3,4,5,4,3,1,1,1,2,1,5,5,3,3,3,3,3,3,5,1,3,1,3,3,3,3,null,null,null,null,null,null,null,null,{"$f":"Fragen!B32","v":0},null,null,null,9,9,"Prüfstatiker",null,null,42.587500168118034,6.3599380648240338]
["Frage 9",4,3,4,2,2,4,4,3,2,1,2,2,3,3,4,5,1,2,3,3,1,2,3,3,2,1,3,3,4,5,2,3,3,2,4,4,2,3,4,2,2,1,null,null,null,null,null,null,null,null,{"$f":"Fragen!B35","v":0},null,null,null,10,10,"Stadtplanung",null,null,43.678920393835078,3.9601574453934196]
["Frage 10",3,2,1,4,4,1,3,3,2,1,2,2,2,2,1,3,1,2,2,3,2,2,2,2,2,1,2,2,1,4,5,2,2,1,5,5,3,1,4,2,2,2,null,null,null,null,null,null,null,null,{"$f":"Fragen!B38","v":0},null,null,null,11,11,"Bauüberwachung",null,null,43.931214142541918,3.4054218501716971]
[null,null,null,null,null,null,null,null,null,null,null,null,null,null,null,null,null,null,null,null,null,null,null,null,null,null,null,null,null,null,null,null,null,null,null,null,null,null,null,null,null,null,null,null,null,null,null,null,null,null,null,null,null,null,null,12,12,"Allg. Genehmigungsplanung",null,null,44.905436620782659,1.2633319683758693]
["Frage 11",5,5,5,3,3,4,2,2,4,3,4,4,4,4,2,2,2,4,4,4,3,3,4,4,4,3,4,4,2,3,1,3,3,4,2,2,2,2,4,5,4,5,null,null,null,null,null,null,null,null,{"$f":"Fragen!B41","v":0},null,null,null,13,13,"Bauwirtschaft - Bauleitung (Tiefbau)",null,null,46.527403940933141,-2.3029989906181436]
[null,null,null,null,null,null,null,null,null,null,null,null,null,null,null,null,null,null,null,null,null,null,null,null,null,null,null,null,null,null,null,null,null,null,null,null,null,null,null,null,null,null,null,null,null,null,null,null,null,null,null,null,null,null,null,14,14,"Stahlbau",null,null,46.754811634522426,-2.8030159070413951]
["Frage 12",3,2,4,4,5,5,2,4,5,5,4,4,5,4,2,5,5,4,3,2,3,2,4,4,3,4,3,5,5,2,5,1,4,5,3,3,4,2,2,4,4,5,null,null,null,null,null,null,null,null,{"$f":"Fragen!B44","v":0},null,null,null,15,15,"Bauindustrie - Techn. Außendienst",null,null,46.90635867171212,-3.1362327874057128]
["Frage 13",1,2,3,4,5,2,5,3,4,2,4,4,4,4,3,4,1,4,2,4,2,1,2,2,2,5,3,4,5,2,2,2,4,1,5,5,2,1,3,4,4,5,null,null,null,null,null,null,null,null,{"$f":"Fragen!B47","v":0},null,null,null,16,16,"Projektentwicklung",null,null,47.290696335056502,-3.981302407775944]
["Frage 14",2,3,2,5,5,3,4,3,2,2,3,3,3,3,4,3,2,3,2,3,3,2,2,3,3,4,3,2,5,2,3,4,4,5,3,3,4,3,4,4,4,4,null,null,null,null,null,null,null,null,{"$f":"Fragen!B50","v":0},null,null,null,17,17,"Stahlbetonbau",null,null,47.634165622078825,-4.7365119218971463]
["Frage 15",4,3,4,2,2,4,5,5,2,5,3,3,3,3,4,5,5,4,4,2,4,4,3,3,2,2,4,4,1,2,3,3,5,3,4,4,4,4,2,3,3,2,null,null,null,null,null,null,null,null,{"$f":"Fragen!B53","v":0},null,null,null,18,18,"Spannbetonbau",null,null,47.912005296497782,-5.34741709871982]
[null,null,null,null,null,null,null,null,null,null,null,null,null,null,null,null,null,null,null,null,null,null,null,null,null,null,null,null,null,null,null,null,null,null,null,null,null,null,null,null,null,null,null,null,null,null,null,null,null,null,null,null,null,null,null,19,19,"Vermessung",null,null,48.62134799230838,-6.9070976084177227]
["Diff. F1",{"$f":"ABS($AZ2-B2)^$AZ21","v":5.4189919336718404},4.2870938501451725,3.1694019256486143,4.2870938501451725,4.2870938501451725,5.4189919336718404,2.0705298476827552,2.0705298476827552,4.2870938501451725,3.1694019256486143,3.1694019256486143,4.2870938501451725,4.2870938501451725,3.1694019256486143,1,2.0705298476827552,3.1694019256486143,2.0705298476827552,3.1694019256486143,3.1694019256486143,2.0705298476827552,3.1694019256486143,3.1694019256486143,4.2870938501451725,4.2870938501451725,3.1694019256486143,4.2870938501451725,4.2870938501451725,5.4189919336718404,5.4189919336718404,1,4.2870938501451725,2.0705298476827552,5.4189919336718404,1,1,3.1694019256486143,2.0705298476827552,3.1694019256486143,4.2870938501451725,4.2870938501451725,5.4189919336718404,null,"Abweichungsfaktor AF",null,null,null,null,null,null,1.05,{"$f":"4*AZ21","v":4.2},null,null,20,20,"Brandschutzplanung",null,null,48.888836175842613,-7.4952422511930683]
["Diff. F2",{"$f":"ABS($AZ3-B3)^$AZ22","v":6.3652505777321169},4.9245776533796644,2.2191389441356897,6.3652505777321169,6.3652505777321169,6.3652505777321169,3.5374429370440996,3.5374429370440996,6.3652505777321169,4.9245776533796644,4.9245776533796644,4.9245776533796644,4.9245776533796644,3.5374429370440996,2.2191389441356897,3.5374429370440996,4.9245776533796644,4.9245776533796644,4.9245776533796644,4.9245776533796644,3.5374429370440996,2.2191389441356897,2.2191389441356897,3.5374429370440996,4.9245776533796644,3.5374429370440996,4.9245776533796644,6.3652505777321169,6.3652505777321169,4.9245776533796644,3.5374429370440996,4.9245776533796644,3.5374429370440996,6.3652505777321169,3.5374429370440996,2.2191389441356897,4.9245776533796644,3.5374429370440996,4.9245776533796644,6.3652505777321169,6.3652505777321169,6.3652505777321169,null,null,null,null,null,null,null,null,1.1499999999999999,{"$f":"4*AZ22","v":4.5999999999999996},null,null,21,21,"Bauphysikalische Planung",null,null,49.353351668839551,-8.5166043729981276]
["Diff. F3",{"$f":"ABS($AZ4-B4)^$AZ23","v":3},2,3,2,3,4,1,3,2,3,2,2,2,2,4,2,4,3,3,2,3,3,3,2,3,3,3,3,4,2,1,2,2,4,1,1,{"$f":"ABS($AZ4-AL4)^$AZ23","v":4},3,3,1,1,2,null,"Berechnung",null,null,null,null,null,null,1,4,null,null,22,22,"Glas-/Aluminiumbau",null,null,49.581753690942207,-9.0188075878236731]
["Diff. F4",{"$f":"ABS($AZ5-B5)^$AZ24","v":2},2,4,2,2,2,1,2,1,1,2,2,2,3,2,2,1,2,2,3,3,2,2,3,2,2,2,4,3,1,2,2,1,2,1,1,{"$f":"ABS($AZ5-AL5)^$AZ24","v":2},2,3,2,2,4,null,"(Antwort-Vorgabe)^AF",null,null,null,null,null,null,1,4,null,null,23,23,"Wissenschaftliche Assistenz",null,null,50.33607739600042,-10.67739093227884]
["Diff. F5",{"$f":"ABS($AZ6-B6)^$AZ25","v":3.1694019256486143},3.1694019256486143,2.0705298476827552,4.2870938501451725,3.1694019256486143,3.1694019256486143,5.4189919336718404,4.2870938501451725,3.1694019256486143,4.2870938501451725,3.1694019256486143,3.1694019256486143,3.1694019256486143,3.1694019256486143,4.2870938501451725,5.4189919336718404,5.4189919336718404,2.0705298476827552,3.1694019256486143,4.2870938501451725,3.1694019256486143,2.0705298476827552,3.1694019256486143,2.0705298476827552,2.0705298476827552,3.1694019256486143,3.1694019256486143,4.2870938501451725,2.0705298476827552,2.0705298476827552,4.2870938501451725,2.0705298476827552,1,4.2870938501451725,3.1694019256486143,3.1694019256486143,{"$f":"ABS($AZ6-AL6)^$AZ25","v":4.2870938501451725},4.2870938501451725,3.1694019256486143,4.2870938501451725,4.2870938501451725,5.4189919336718404,null,"zur Gewichtung bestimmter",null,null,null,null,null,null,1.05,4.2,null,null,24,24,"Bauindustrie - Herstellung",null,null,50.511575055651008,-11.063269691405031]
["Diff. F6",{"$f":"ABS($AZ7-B7)^$AZ26","v":0},0,0,0,0,0,0,0,0,0,0,0,0,0,0,0,0,0,0,0,0,0,0,0,0,0,0,0,0,0,0,0,0,0,0,0,{"$f":"ABS($AZ7-AL7)^$AZ26","v":0},0,0,0,0,0,null,"Fragen zur Optimierung",null,null,null,null,null,null,1,4,null,null,25,25,"Sicherheits- und Gesundheitskoordination (SiGeKo)",null,null,51.252426091881489,-12.692229753477324]
["Diff. F7",{"$f":"ABS($AZ8-B8)^$AZ27","v":4.2870938501451725},1,4.2870938501451725,2.0705298476827552,2.0705298476827552,1,5.4189919336718404,3.1694019256486143,1,1,1,1,1,2.0705298476827552,3.1694019256486143,3.1694019256486143,1,2.0705298476827552,1,3.1694019256486143,2.0705298476827552,1,1,1,1,1,1,1,1,5.4189919336718404,5.4189919336718404,3.1694019256486143,5.4189919336718404,1,5.4189919336718404,5.4189919336718404,{"$f":"ABS($AZ8-AL8)^$AZ27","v":2.0705298476827552},2.0705298476827552,4.2870938501451725,3.1694019256486143,2.0705298476827552,5.4189919336718404,null,"1= Standard",null,null,null,null,null,null,1.05,4.2,null,null,26,26,"Denkmalpflege",null,null,51.310611774847601,-12.82016661136236]
["Diff. F8",{"$f":"ABS($AZ9-B9)^$AZ28","v":2.1435469250725863},3.3483695221017138,2.1435469250725863,5.8730947154400956,4.5947934199881395,5.8730947154400956,2.1435469250725863,2.1435469250725863,1,1,1,3.3483695221017138,3.3483695221017138,2.1435469250725863,2.1435469250725863,1,1,2.1435469250725863,2.1435469250725863,3.3483695221017138,1,2.1435469250725863,3.3483695221017138,3.3483695221017138,3.3483695221017138,2.1435469250725863,3.3483695221017138,1,2.1435469250725863,4.5947934199881395,3.3483695221017138,5.8730947154400956,5.8730947154400956,5.8730947154400956,4.5947934199881395,4.5947934199881395,{"$f":"ABS($AZ9-AL9)^$AZ28","v":1},2.1435469250725863,3.3483695221017138,2.1435469250725863,2.1435469250725863,1,null,null,null,null,null,null,null,null,1.1000000000000001,4.4000000000000004,null,null,27,27,"Projektsteuerung",null,null,51.332211787084638,-12.867660041962692]
["Diff. F9",{"$f":"ABS($AZ10-B10)^$AZ29","v":4.6555367217460786},2.6390158215457884,6.9644045063689921,4.6555367217460786,4.6555367217460786,4.6555367217460786,4.6555367217460786,4.6555367217460786,4.6555367217460786,4.6555367217460786,6.9644045063689921,4.6555367217460786,6.9644045063689921,6.9644045063689921,4.6555367217460786,4.6555367217460786,4.6555367217460786,6.9644045063689921,9.5182696935793913,6.9644045063689921,4.6555367217460786,1,1,1,2.6390158215457884,1,9.5182696935793913,9.5182696935793913,4.6555367217460786,4.6555367217460786,4.6555367217460786,4.6555367217460786,4.6555367217460786,4.6555367217460786,9.5182696935793913,1,{"$f":"ABS($AZ10-AL10)^$AZ29","v":4.6555367217460786},1,4.6555367217460786,4.6555367217460786,4.6555367217460786,4.6555367217460786,null,null,null,null,null,null,null,null,1.4,5.6,null,null,28,28,"Sachverständigenwesen",null,null,51.727391075259014,-13.736567887552798]
["Diff. F10",{"$f":"ABS($AZ11-B11)^$AZ30","v":4},3,4,2,2,4,4,3,2,1,2,2,3,3,4,5,1,2,3,3,1,2,3,3,2,1,3,3,4,5,2,3,3,2,4,4,{"$f":"ABS($AZ11-AL11)^$AZ30","v":2},3,4,2,2,1,null,null,null,null,null,null,null,null,1,4,null,null,29,29,"Bauindustrie - Forschung + Entwicklung",null,null,52.072847939577223,-14.496147624400212]
["Diff. F11",{"$f":"ABS($AZ12-B12)^$AZ31","v":3.1694019256486143},2.0705298476827552,1,4.2870938501451725,4.2870938501451725,1,3.1694019256486143,3.1694019256486143,2.0705298476827552,1,2.0705298476827552,2.0705298476827552,2.0705298476827552,2.0705298476827552,1,3.1694019256486143,1,2.0705298476827552,2.0705298476827552,3.1694019256486143,2.0705298476827552,2.0705298476827552,2.0705298476827552,2.0705298476827552,2.0705298476827552,1,2.0705298476827552,2.0705298476827552,1,4.2870938501451725,5.4189919336718404,2.0705298476827552,2.0705298476827552,1,5.4189919336718404,5.4189919336718404,{"$f":"ABS($AZ12-AL12)^$AZ31","v":3.1694019256486143},1,4.2870938501451725,2.0705298476827552,2.0705298476827552,2.0705298476827552,null,null,null,null,null,null,null,null,1.05,4.2,null,null,30,30,"Holzbau",null,null,52.2208730811207,-14.821620670889835]
["Diff. F12",{"$f":"ABS($AZ13-B13)^$AZ32","v":0},0,0,0,0,0,0,0,0,0,0,0,0,0,0,0,0,0,0,0,0,0,0,0,0,0,0,0,0,0,0,0,0,0,0,0,{"$f":"ABS($AZ13-AL13)^$AZ32","v":0},0,0,0,0,0,null,null,null,null,null,null,null,null,1,4,null,null,31,31,"Energieberatung",null,null,52.390275006769308,-15.194096320952744]
["Diff. F13",{"$f":"ABS($AZ14-B14)^$AZ33","v":5},5,5,3,3,4,2,2,4,3,4,4,4,4,2,2,2,4,4,4,3,3,4,4,4,3,4,4,2,3,1,3,3,4,2,2,{"$f":"ABS($AZ14-AL14)^$AZ33","v":2},2,4,5,4,5,null,null,null,null,null,null,null,null,1,4,null,null,32,32,"Lehre in der Berufsbildung",null,null,52.434949473966284,-15.292325140647044]
["Diff. F14",{"$f":"ABS($AZ15-B15)^$AZ34","v":0},0,0,0,0,0,0,0,0,0,0,0,0,0,0,0,0,0,0,0,0,0,0,0,0,0,0,0,0,0,0,0,0,0,0,0,{"$f":"ABS($AZ15-AL15)^$AZ34","v":0},0,0,0,0,0,null,null,null,null,null,null,null,null,1,4,null,null,33,33,"Infrastrukturmanagement",null,null,53.081407222146403,-16.713736196452068]
["Diff. F15",{"$f":"ABS($AZ16-B16)^$AZ35","v":3},2,4,4,5,5,2,4,5,5,4,4,5,4,2,5,5,4,3,2,3,2,4,4,3,4,3,5,5,2,5,1,4,5,3,3,{"$f":"ABS($AZ16-AL16)^$AZ35","v":4},2,2,4,4,5,null,null,null,null,null,null,null,null,1,4,null,null,34,34,"Sachbearbeitung Bauordnungsamt",null,null,53.496317709810185,-17.626028385686411]
["Diff. F16",{"$f":"ABS($AZ17-B17)^$AZ36","v":1},2.0705298476827552,3.1694019256486143,4.2870938501451725,5.4189919336718404,2.0705298476827552,5.4189919336718404,3.1694019256486143,4.2870938501451725,2.0705298476827552,4.2870938501451725,4.2870938501451725,4.2870938501451725,4.2870938501451725,3.1694019256486143,4.2870938501451725,1,4.2870938501451725,2.0705298476827552,4.2870938501451725,2.0705298476827552,1,2.0705298476827552,2.0705298476827552,2.0705298476827552,5.4189919336718404,3.1694019256486143,4.2870938501451725,5.4189919336718404,2.0705298476827552,2.0705298476827552,2.0705298476827552,4.2870938501451725,1,5.4189919336718404,5.4189919336718404,{"$f":"ABS($AZ17-AL17)^$AZ36","v":2.0705298476827552},1,3.1694019256486143,4.2870938501451725,4.2870938501451725,5.4189919336718404,null,null,null,null,null,null,null,null,1.05,4.2,null,null,35,35,"Technische Gebäudeausrüstung (TGA)",null,null,53.774738268331106,-18.238210792284736]
["Diff. F17",{"$f":"ABS($AZ18-B18)^$AZ37","v":2},3,2,5,5,3,4,3,2,2,3,3,3,3,4,3,2,3,2,3,3,2,2,3,3,4,3,2,5,2,3,4,4,5,3,3,{"$f":"ABS($AZ18-AL18)^$AZ37","v":4},3,4,4,4,4,null,null,null,null,null,null,null,null,1,4,null,null,36,36,"Bauwirtschaft - Kalkulation",null,null,54.769369724383921,-20.425175295479136]
["Diff. F18",{"$f":"ABS($AZ19-B19)^$AZ38","v":4.2870938501451725},3.1694019256486143,4.2870938501451725,2.0705298476827552,2.0705298476827552,4.2870938501451725,5.4189919336718404,5.4189919336718404,2.0705298476827552,5.4189919336718404,3.1694019256486143,3.1694019256486143,3.1694019256486143,3.1694019256486143,4.2870938501451725,5.4189919336718404,5.4189919336718404,4.2870938501451725,4.2870938501451725,2.0705298476827552,4.2870938501451725,4.2870938501451725,3.1694019256486143,3.1694019256486143,2.0705298476827552,2.0705298476827552,4.2870938501451725,4.2870938501451725,1,2.0705298476827552,3.1694019256486143,3.1694019256486143,5.4189919336718404,3.1694019256486143,4.2870938501451725,4.2870938501451725,{"$f":"ABS($AZ19-AL19)^$AZ38","v":4.2870938501451725},4.2870938501451725,2.0705298476827552,3.1694019256486143,3.1694019256486143,2.0705298476827552,null,null,null,null,null,null,null,null,1.05,4.2,null,null,37,37,"Ausschreibung und Vergabe",null,null,55.83989957206667,-22.77902280577544]
[null,null,null,null,null,null,null,null,null,null,null,null,null,null,null,null,null,null,null,null,null,null,null,null,null,null,null,null,null,null,null,null,null,null,null,null,null,null,null,null,null,null,null,null,null,null,null,null,null,null,null,null,null,null,null,38,38,"Kostenplanung",null,null,56.183317110864486,-23.534118537520854]
["Summe",{"$f":"SUM(B21:B38)","v":53.496317709810185},{"$f":"SUM(C21:C38)","v":43.678920393835078},51.310611774847601,56.183317110864486,56.91922197444265,55.83989957206667,51.252426091881489,48.62134799230838,44.905436620782659,42.526131932274126,46.754811634522426,47.912005296497782,52.2208730811207,49.581753690942207,43.931214142541918,51.727391075259014,42.587500168118034,48.888836175842613,49.353351668839551,52.390275006769308,40.931594825314988,32.960241340367574,39.216773938548755,41.553897777987864,41.481176237903362,39.509315494768508,53.774738268331106,58.10242551957495,52.072847939577223,50.511575055651008,46.90635867171212,47.290696335056502,51.332211787084638,54.769369724383921,56.363977627420937,46.527403940933141,{"$f":"SUM(AL21:AL38)","v":47.634165622078825},36.39623725777254,53.081407222146403,52.434949473966284,50.33607739600042,58.837814729531068,null,"theoretische max. Abweichung",null,null,null,null,null,null,null,{"$f":"SUM(BA21:BA38)","v":75.800000000000011},null,null,39,39,"Bauwirtschaft - Bauleitung (Hochbau)",null,null,56.363977627420937,-23.93134922476019]
["Rang",{"$f":"_xlfn.RANK.EQ(B40,$B$40:$AQ$40,1)","v":34},10,26,38,40,37,25,19,12,8,14,18,30,22,11,28,9,20,21,31,5,1,3,7,6,4,35,41,29,24,15,16,27,36,39,13,{"$f":"_xlfn.RANK.EQ(AL40,$B$40:$AQ$40,1)","v":17},2,33,32,23,42,null,"begrenztes Abweichungsniveau",null,null,null,null,null,null,null,{"$f":"0.6*BA40","v":45.480000000000004},null,null,40,40,"Termin- und Kapazitätsplanung",null,null,56.91922197444265,-25.15220311003219]
["Alphabet",{"$f":"SUMPRODUCT(($B$1:$AQ$1 < B1)+(B1=\"\")*1000)","v":26},31,14,21,37,1,28,39,0,34,32,30,19,17,7,27,25,12,6,15,2,16,40,18,13,38,36,11,3,4,5,23,24,10,8,9,{"$f":"SUMPRODUCT(($B$1:$AQ$1 < AL1)+(AL1=\"\")*1000)","v":33},35,20,22,41,29,null,null,null,null,null,null,null,null,null,null,null,null,41,41,"Beleuchtungsplanung",null,null,58.10242551957495,-27.753794018414556]
["Ausgabe",{"$f":"SUMPRODUCT(($B$41:$AQ$41+($B42:$AQ42*10^-6)<B41+(B42*10^-6))*1)+1","v":34},10,26,38,40,37,25,19,12,8,14,18,30,22,11,28,9,20,21,31,5,1,3,7,6,4,35,41,29,24,15,16,27,36,39,13,{"$f":"SUMPRODUCT(($B$41:$AQ$41+($B42:$AQ42*10^-6)<AL41+(AL42*10^-6))*1)+1","v":17},2,33,32,23,42]
["Beruf",{"$f":"B1","v":"Sachbearbeitung Bauordnungsamt"},"Stadtplanung","Denkmalpflege","Kostenplanung","Termin- und Kapazitätsplanung","Ausschreibung und Vergabe","Sicherheits- und Gesundheitskoordination (SiGeKo)","Vermessung","Allg. Genehmigungsplanung","Statik und Prüfstatik","Stahlbau","Spannbetonbau","Holzbau","Glas-/Aluminiumbau","Bauüberwachung","Sachverständigenwesen","Prüfstatiker","Brandschutzplanung","Bauphysikalische Planung","Energieberatung","Baudynamik","Geotechnik","Wasserbau","Gleis- und Bahnbau","Brückenbau","Tunnelbau","Technische Gebäudeausrüstung (TGA)","Beleuchtungsplanung","Bauindustrie - Forschung + Entwicklung","Bauindustrie - Herstellung","Bauindustrie - Techn. Außendienst","Projektentwicklung","Projektsteuerung","Bauwirtschaft - Kalkulation","Bauwirtschaft - Bauleitung (Hochbau)","Bauwirtschaft - Bauleitung (Tiefbau)","Stahlbetonbau","Straßenbau","Infrastrukturmanagement","Lehre in der Berufsbildung","Wissenschaftliche Assistenz","Softwareentwicklung im Baubereich"]

{"sheet":"Ergebnisse","index":2,"n_rows":53,"n_cols":27,"rows_kept":53,"cut":false,"hidden":false,"merged":[[34,2,34,4]]}
[]
[]
[]
[]
[]
[]
[]
[null,"Die fünf Berufszweige mit der größten Übereinstimmung"]
[]
[null,{"$f":"Berechnung!BD2","v":1},{"$f":"Berechnung!BF2","v":"Geotechnik"},null,null,{"$f":"Berechnung!BJ2","v":27.528053341320202},"%",{"$f":"IF($F10<5,\"x\",$F10)","v":27.528053341320202},{"$f":"IF($F10<10,\"x\",$F10)","v":27.528053341320202},{"$f":"IF($F10<15,\"x\",$F10)","v":27.528053341320202},{"$f":"IF($F10<20,\"x\",$F10)","v":27.528053341320202},{"$f":"IF($F10<25,\"x\",$F10)","v":27.528053341320202},{"$f":"IF($F10<30,\"x\",$F10)","v":"x"},{"$f":"IF($F10<35,\"x\",$F10)","v":"x"},{"$f":"IF($F10<40,\"x\",$F10)","v":"x"},{"$f":"IF($F10<45,\"x\",$F10)","v":"x"},{"$f":"IF($F10<50,\"x\",$F10)","v":"x"},{"$f":"IF($F10<55,\"x\",$F10)","v":"x"},{"$f":"IF($F10<60,\"x\",$F10)","v":"x"},{"$f":"IF($F10<65,\"x\",$F10)","v":"x"},{"$f":"IF($F10<70,\"x\",$F10)","v":"x"},{"$f":"IF($F10<75,\"x\",$F10)","v":"x"},{"$f":"IF($F10<80,\"x\",$F10)","v":"x"},{"$f":"IF($F10<85,\"x\",$F10)","v":"x"},{"$f":"IF($F10<90,\"x\",$F10)","v":"x"},{"$f":"IF($F10<95,\"x\",$F10)","v":"x"},{"$f":"IF($F10<100,\"x\",$F10)","v":"x"}]
[]
[null,{"$f":"Berechnung!BD3","v":2},{"$f":"Berechnung!BF3","v":"Straßenbau"},null,null,{"$f":"Berechnung!BJ3","v":19.973093100763993},"%",{"$f":"IF($F12<5,\"x\",$F12)","v":19.973093100763993},{"$f":"IF($F12<10,\"x\",$F12)","v":19.973093100763993},{"$f":"IF($F12<15,\"x\",$F12)","v":19.973093100763993},{"$f":"IF($F12<20,\"x\",$F12)","v":"x"},{"$f":"IF($F12<25,\"x\",$F12)","v":"x"},{"$f":"IF($F12<30,\"x\",$F12)","v":"x"},{"$f":"IF($F12<35,\"x\",$F12)","v":"x"},{"$f":"IF($F12<40,\"x\",$F12)","v":"x"},{"$f":"IF($F12<45,\"x\",$F12)","v":"x"},{"$f":"IF($F12<50,\"x\",$F12)","v":"x"},{"$f":"IF($F12<55,\"x\",$F12)","v":"x"},{"$f":"IF($F12<60,\"x\",$F12)","v":"x"},{"$f":"IF($F12<65,\"x\",$F12)","v":"x"},{"$f":"IF($F12<70,\"x\",$F12)","v":"x"},{"$f":"IF($F12<75,\"x\",$F12)","v":"x"},{"$f":"IF($F12<80,\"x\",$F12)","v":"x"},{"$f":"IF($F12<85,\"x\",$F12)","v":"x"},{"$f":"IF($F12<90,\"x\",$F12)","v":"x"},{"$f":"IF($F12<95,\"x\",$F12)","v":"x"},{"$f":"IF($F12<100,\"x\",$F12)","v":"x"}]
[]
[null,{"$f":"Berechnung!BD4","v":3},{"$f":"Berechnung!BF4","v":"Wasserbau"},null,null,{"$f":"Berechnung!BJ4","v":13.771385359391486},"%",{"$f":"IF($F14<5,\"x\",$F14)","v":13.771385359391486},{"$f":"IF($F14<10,\"x\",$F14)","v":13.771385359391486},{"$f":"IF($F14<15,\"x\",$F14)","v":"x"},{"$f":"IF($F14<20,\"x\",$F14)","v":"x"},{"$f":"IF($F14<25,\"x\",$F14)","v":"x"},{"$f":"IF($F14<30,\"x\",$F14)","v":"x"},{"$f":"IF($F14<35,\"x\",$F14)","v":"x"},{"$f":"IF($F14<40,\"x\",$F14)","v":"x"},{"$f":"IF($F14<45,\"x\",$F14)","v":"x"},{"$f":"IF($F14<50,\"x\",$F14)","v":"x"},{"$f":"IF($F14<55,\"x\",$F14)","v":"x"},{"$f":"IF($F14<60,\"x\",$F14)","v":"x"},{"$f":"IF($F14<65,\"x\",$F14)","v":"x"},{"$f":"IF($F14<70,\"x\",$F14)","v":"x"},{"$f":"IF($F14<75,\"x\",$F14)","v":"x"},{"$f":"IF($F14<80,\"x\",$F14)","v":"x"},{"$f":"IF($F14<85,\"x\",$F14)","v":"x"},{"$f":"IF($F14<90,\"x\",$F14)","v":"x"},{"$f":"IF($F14<95,\"x\",$F14)","v":"x"},{"$f":"IF($F14<100,\"x\",$F14)","v":"x"}]
[]
[null,{"$f":"Berechnung!BD5","v":4},{"$f":"Berechnung!BF5","v":"Tunnelbau"},null,null,{"$f":"Berechnung!BJ5","v":13.128154145187986},"%",{"$f":"IF($F16<5,\"x\",$F16)","v":13.128154145187986},{"$f":"IF($F16<10,\"x\",$F16)","v":13.128154145187986},{"$f":"IF($F16<15,\"x\",$F16)","v":"x"},{"$f":"IF($F16<20,\"x\",$F16)","v":"x"},{"$f":"IF($F16<25,\"x\",$F16)","v":"x"},{"$f":"IF($F16<30,\"x\",$F16)","v":"x"},{"$f":"IF($F16<35,\"x\",$F16)","v":"x"},{"$f":"IF($F16<40,\"x\",$F16)","v":"x"},{"$f":"IF($F16<45,\"x\",$F16)","v":"x"},{"$f":"IF($F16<50,\"x\",$F16)","v":"x"},{"$f":"IF($F16<55,\"x\",$F16)","v":"x"},{"$f":"IF($F16<60,\"x\",$F16)","v":"x"},{"$f":"IF($F16<65,\"x\",$F16)","v":"x"},{"$f":"IF($F16<70,\"x\",$F16)","v":"x"},{"$f":"IF($F16<75,\"x\",$F16)","v":"x"},{"$f":"IF($F16<80,\"x\",$F16)","v":"x"},{"$f":"IF($F16<85,\"x\",$F16)","v":"x"},{"$f":"IF($F16<90,\"x\",$F16)","v":"x"},{"$f":"IF($F16<95,\"x\",$F16)","v":"x"},{"$f":"IF($F16<100,\"x\",$F16)","v":"x"}]
[]
[null,{"$f":"Berechnung!BD6","v":5},{"$f":"Berechnung!BF6","v":"Baudynamik"},null,null,{"$f":"Berechnung!BJ6","v":10.000890885411206},"%",{"$f":"IF($F18<5,\"x\",$F18)","v":10.000890885411206},{"$f":"IF($F18<10,\"x\",$F18)","v":10.000890885411206},{"$f":"IF($F18<15,\"x\",$F18)","v":"x"},{"$f":"IF($F18<20,\"x\",$F18)","v":"x"},{"$f":"IF($F18<25,\"x\",$F18)","v":"x"},{"$f":"IF($F18<30,\"x\",$F18)","v":"x"},{"$f":"IF($F18<35,\"x\",$F18)","v":"x"},{"$f":"IF($F18<40,\"x\",$F18)","v":"x"},{"$f":"IF($F18<45,\"x\",$F18)","v":"x"},{"$f":"IF($F18<50,\"x\",$F18)","v":"x"},{"$f":"IF($F18<55,\"x\",$F18)","v":"x"},{"$f":"IF($F18<60,\"x\",$F18)","v":"x"},{"$f":"IF($F18<65,\"x\",$F18)","v":"x"},{"$f":"IF($F18<70,\"x\",$F18)","v":"x"},{"$f":"IF($F18<75,\"x\",$F18)","v":"x"},{"$f":"IF($F18<80,\"x\",$F18)","v":"x"},{"$f":"IF($F18<85,\"x\",$F18)","v":"x"},{"$f":"IF($F18<90,\"x\",$F18)","v":"x"},{"$f":"IF($F18<95,\"x\",$F18)","v":"x"},{"$f":"IF($F18<100,\"x\",$F18)","v":"x"}]
[]
[]
[null,"Die fünf Berufszweige mit der geringsten Übereinstimmung"]
[]
[null,{"$f":"Berechnung!BD38","v":37},{"$f":"Berechnung!BF38","v":"Ausschreibung und Vergabe"},null,null,{"$f":"Berechnung!BJ38","v":-22.77902280577544},"%",{"$f":"IF($F23<5,\"x\",$F23)","v":"x"},{"$f":"IF($F23<10,\"x\",$F23)","v":"x"},{"$f":"IF($F23<15,\"x\",$F23)","v":"x"},{"$f":"IF($F23<20,\"x\",$F23)","v":"x"},{"$f":"IF($F23<25,\"x\",$F23)","v":"x"},{"$f":"IF($F23<30,\"x\",$F23)","v":"x"},{"$f":"IF($F23<35,\"x\",$F23)","v":"x"},{"$f":"IF($F23<40,\"x\",$F23)","v":"x"},{"$f":"IF($F23<45,\"x\",$F23)","v":"x"},{"$f":"IF($F23<50,\"x\",$F23)","v":"x"},{"$f":"IF($F23<55,\"x\",$F23)","v":"x"},{"$f":"IF($F23<60,\"x\",$F23)","v":"x"},{"$f":"IF($F23<65,\"x\",$F23)","v":"x"},{"$f":"IF($F23<70,\"x\",$F23)","v":"x"},{"$f":"IF($F23<75,\"x\",$F23)","v":"x"},{"$f":"IF($F23<80,\"x\",$F23)","v":"x"},{"$f":"IF($F23<85,\"x\",$F23)","v":"x"},{"$f":"IF($F23<90,\"x\",$F23)","v":"x"},{"$f":"IF($F23<95,\"x\",$F23)","v":"x"},{"$f":"IF($F23<100,\"x\",$F23)","v":"x"}]
[]
[null,{"$f":"Berechnung!BD39","v":38},{"$f":"Berechnung!BF39","v":"Kostenplanung"},null,null,{"$f":"Berechnung!BJ39","v":-23.534118537520854},"%","x","x","x","x","x","x","x","x","x","x","x","x","x","x","x","x","x","x","x","x"]
[]
[null,{"$f":"Berechnung!BD40","v":39},{"$f":"Berechnung!BF40","v":"Bauwirtschaft - Bauleitung (Hochbau)"},null,null,{"$f":"Berechnung!BJ40","v":-23.93134922476019},"%","x","x","x","x","x","x","x","x","x","x","x","x","x","x","x","x","x","x","x","x"]
[]
[null,{"$f":"Berechnung!BD41","v":40},{"$f":"Berechnung!BF41","v":"Termin- und Kapazitätsplanung"},null,null,{"$f":"Berechnung!BJ41","v":-25.15220311003219},"%","x","x","x","x","x","x","x","x","x","x","x","x","x","x","x","x","x","x","x","x"]
[]
[null,{"$f":"Berechnung!BD42","v":41},{"$f":"Berechnung!BF42","v":"Beleuchtungsplanung"},null,null,{"$f":"Berechnung!BJ42","v":-27.753794018414556},"%","x","x","x","x","x","x","x","x","x","x","x","x","x","x","x","x","x","x","x","x"]
[]
[null,"Vergleich meiner Einzelantworten"]
[]
[null,"mit","Projektsteuerung"]
[]
[null,"Frage","Thema","von (1)","bis (5)","eigene","V"]
[]
[null,1,"Arbeitsplatz","flexibel","ortsfest",{"$f":"Berechnung!AZ2","v":0},{"$f":"HLOOKUP($C$35,Berechnung!$B$1:$AQ$19,2,FALSE)","v":2},null,0,5]
[null,2,"Arbeitsort","draußen","temperiert",{"$f":"Berechnung!AZ3","v":0},{"$f":"HLOOKUP($C$35,Berechnung!$B$1:$AQ$19,3,FALSE)","v":3},null,5,0]
[null,3,"Fremdmotivation","ist leicht","ist schwer",{"$f":"Berechnung!AZ4","v":0},{"$f":"HLOOKUP($C$35,Berechnung!$B$1:$AQ$19,4,FALSE)","v":2},null,0,5]
[null,4,"Anweisungen","selbst geben","bekommen",{"$f":"Berechnung!AZ5","v":0},{"$f":"HLOOKUP($C$35,Berechnung!$B$1:$AQ$19,5,FALSE)","v":1},null,5,0]
[null,5,"Arbeitsweise","Teamarbeit","Einzelarbeit",{"$f":"Berechnung!AZ6","v":0},{"$f":"HLOOKUP($C$35,Berechnung!$B$1:$AQ$19,6,FALSE)","v":1},null,0,5]
[null,6,"Umsetzung","Planung","Ausführung",{"$f":"Berechnung!AZ8","v":0},{"$f":"HLOOKUP($C$35,Berechnung!$B$1:$AQ$19,8,FALSE)","v":5},null,5,0]
[null,7,"Interesse","technisch","wirtschaftlich",{"$f":"Berechnung!AZ9","v":0},{"$f":"HLOOKUP($C$35,Berechnung!$B$1:$AQ$19,9,FALSE)","v":5},null,0,5]
[null,8,"Bereich","Tiefbau","Hoch-/Ausbau",{"$f":"Berechnung!AZ10","v":0},{"$f":"HLOOKUP($C$35,Berechnung!$B$1:$AQ$19,10,FALSE)","v":3},null,5,0]
[null,9,"Vorstellen","im Kopf","in der Hand",{"$f":"Berechnung!AZ11","v":0},{"$f":"HLOOKUP($C$35,Berechnung!$B$1:$AQ$19,11,FALSE)","v":3},null,0,5]
[null,10,"Konzentration","ein Vorhaben","viele Vorhaben",{"$f":"Berechnung!AZ12","v":0},{"$f":"HLOOKUP($C$35,Berechnung!$B$1:$AQ$19,12,FALSE)","v":2},null,5,0]
[null,11,"Arbeitszeit","eher flexibel","fest geregelt",{"$f":"Berechnung!AZ14","v":0},{"$f":"HLOOKUP($C$35,Berechnung!$B$1:$AQ$19,14,FALSE)","v":3},null,0,5]
[null,12,"Analyse","als Ganzes","im Detail",{"$f":"Berechnung!AZ16","v":0},{"$f":"HLOOKUP($C$35,Berechnung!$B$1:$AQ$19,16,FALSE)","v":4},null,5,0]
[null,13,"Lösungen","vorgeplant","spontan",{"$f":"Berechnung!AZ17","v":0},{"$f":"HLOOKUP($C$35,Berechnung!$B$1:$AQ$19,17,FALSE)","v":4},null,0,5]
[null,14,"Veränderungen","notwendig","verbessern",{"$f":"Berechnung!AZ18","v":0},{"$f":"HLOOKUP($C$35,Berechnung!$B$1:$AQ$19,18,FALSE)","v":4},null,5,0]
[null,15,"Konfliktlösung","Kompromiss","klare Position",{"$f":"Berechnung!AZ19","v":0},{"$f":"HLOOKUP($C$35,Berechnung!$B$1:$AQ$19,19,FALSE)","v":5},null,0,5]

{"sheet":"Gesamtauswertung","index":3,"n_rows":88,"n_cols":27,"rows_kept":88,"cut":false,"hidden":false,"merged":[]}
[]
[]
[]
[]
[]
[]
[]
[null,{"$f":"Berechnung!BD2","v":1},{"$f":"Berechnung!BF2","v":"Geotechnik"},null,null,{"$f":"Berechnung!BJ2","v":27.528053341320202},"%",{"$f":"IF($F8<5,\"x\",$F8)","v":27.528053341320202},{"$f":"IF($F8<10,\"x\",$F8)","v":27.528053341320202},{"$f":"IF($F8<15,\"x\",$F8)","v":27.528053341320202},{"$f":"IF($F8<20,\"x\",$F8)","v":27.528053341320202},{"$f":"IF($F8<25,\"x\",$F8)","v":27.528053341320202},{"$f":"IF($F8<30,\"x\",$F8)","v":"x"},{"$f":"IF($F8<35,\"x\",$F8)","v":"x"},{"$f":"IF($F8<40,\"x\",$F8)","v":"x"},{"$f":"IF($F8<45,\"x\",$F8)","v":"x"},{"$f":"IF($F8<50,\"x\",$F8)","v":"x"},{"$f":"IF($F8<55,\"x\",$F8)","v":"x"},{"$f":"IF($F8<60,\"x\",$F8)","v":"x"},{"$f":"IF($F8<65,\"x\",$F8)","v":"x"},{"$f":"IF($F8<70,\"x\",$F8)","v":"x"},{"$f":"IF($F8<75,\"x\",$F8)","v":"x"},{"$f":"IF($F8<80,\"x\",$F8)","v":"x"},{"$f":"IF($F8<85,\"x\",$F8)","v":"x"},{"$f":"IF($F8<90,\"x\",$F8)","v":"x"},{"$f":"IF($F8<95,\"x\",$F8)","v":"x"},{"$f":"IF($F8<100,\"x\",$F8)","v":"x"}]
[]
[null,{"$f":"Berechnung!BD3","v":2},{"$f":"Berechnung!BF3","v":"Straßenbau"},null,null,{"$f":"Berechnung!BJ3","v":19.973093100763993},"%",{"$f":"IF($F10<5,\"x\",$F10)","v":19.973093100763993},{"$f":"IF($F10<10,\"x\",$F10)","v":19.973093100763993},{"$f":"IF($F10<15,\"x\",$F10)","v":19.973093100763993},{"$f":"IF($F10<20,\"x\",$F10)","v":"x"},{"$f":"IF($F10<25,\"x\",$F10)","v":"x"},{"$f":"IF($F10<30,\"x\",$F10)","v":"x"},{"$f":"IF($F10<35,\"x\",$F10)","v":"x"},{"$f":"IF($F10<40,\"x\",$F10)","v":"x"},{"$f":"IF($F10<45,\"x\",$F10)","v":"x"},{"$f":"IF($F10<50,\"x\",$F10)","v":"x"},{"$f":"IF($F10<55,\"x\",$F10)","v":"x"},{"$f":"IF($F10<60,\"x\",$F10)","v":"x"},{"$f":"IF($F10<65,\"x\",$F10)","v":"x"},{"$f":"IF($F10<70,\"x\",$F10)","v":"x"},{"$f":"IF($F10<75,\"x\",$F10)","v":"x"},{"$f":"IF($F10<80,\"x\",$F10)","v":"x"},{"$f":"IF($F10<85,\"x\",$F10)","v":"x"},{"$f":"IF($F10<90,\"x\",$F10)","v":"x"},{"$f":"IF($F10<95,\"x\",$F10)","v":"x"},{"$f":"IF($F10<100,\"x\",$F10)","v":"x"}]
[]
[null,{"$f":"Berechnung!BD4","v":3},{"$f":"Berechnung!BF4","v":"Wasserbau"},null,null,{"$f":"Berechnung!BJ4","v":13.771385359391486},"%",{"$f":"IF($F12<5,\"x\",$F12)","v":13.771385359391486},{"$f":"IF($F12<10,\"x\",$F12)","v":13.771385359391486},{"$f":"IF($F12<15,\"x\",$F12)","v":"x"},{"$f":"IF($F12<20,\"x\",$F12)","v":"x"},{"$f":"IF($F12<25,\"x\",$F12)","v":"x"},{"$f":"IF($F12<30,\"x\",$F12)","v":"x"},{"$f":"IF($F12<35,\"x\",$F12)","v":"x"},{"$f":"IF($F12<40,\"x\",$F12)","v":"x"},{"$f":"IF($F12<45,\"x\",$F12)","v":"x"},{"$f":"IF($F12<50,\"x\",$F12)","v":"x"},{"$f":"IF($F12<55,\"x\",$F12)","v":"x"},{"$f":"IF($F12<60,\"x\",$F12)","v":"x"},{"$f":"IF($F12<65,\"x\",$F12)","v":"x"},{"$f":"IF($F12<70,\"x\",$F12)","v":"x"},{"$f":"IF($F12<75,\"x\",$F12)","v":"x"},{"$f":"IF($F12<80,\"x\",$F12)","v":"x"},{"$f":"IF($F12<85,\"x\",$F12)","v":"x"},{"$f":"IF($F12<90,\"x\",$F12)","v":"x"},{"$f":"IF($F12<95,\"x\",$F12)","v":"x"},{"$f":"IF($F12<100,\"x\",$F12)","v":"x"}]
[]
[null,{"$f":"Berechnung!BD5","v":4},{"$f":"Berechnung!BF5","v":"Tunnelbau"},null,null,{"$f":"Berechnung!BJ5","v":13.128154145187986},"%",{"$f":"IF($F14<5,\"x\",$F14)","v":13.128154145187986},{"$f":"IF($F14<10,\"x\",$F14)","v":13.128154145187986},{"$f":"IF($F14<15,\"x\",$F14)","v":"x"},{"$f":"IF($F14<20,\"x\",$F14)","v":"x"},{"$f":"IF($F14<25,\"x\",$F14)","v":"x"},{"$f":"IF($F14<30,\"x\",$F14)","v":"x"},{"$f":"IF($F14<35,\"x\",$F14)","v":"x"},{"$f":"IF($F14<40,\"x\",$F14)","v":"x"},{"$f":"IF($F14<45,\"x\",$F14)","v":"x"},{"$f":"IF($F14<50,\"x\",$F14)","v":"x"},{"$f":"IF($F14<55,\"x\",$F14)","v":"x"},{"$f":"IF($F14<60,\"x\",$F14)","v":"x"},{"$f":"IF($F14<65,\"x\",$F14)","v":"x"},{"$f":"IF($F14<70,\"x\",$F14)","v":"x"},{"$f":"IF($F14<75,\"x\",$F14)","v":"x"},{"$f":"IF($F14<80,\"x\",$F14)","v":"x"},{"$f":"IF($F14<85,\"x\",$F14)","v":"x"},{"$f":"IF($F14<90,\"x\",$F14)","v":"x"},{"$f":"IF($F14<95,\"x\",$F14)","v":"x"},{"$f":"IF($F14<100,\"x\",$F14)","v":"x"}]
[]
[null,{"$f":"Berechnung!BD6","v":5},{"$f":"Berechnung!BF6","v":"Baudynamik"},null,null,{"$f":"Berechnung!BJ6","v":10.000890885411206},"%",{"$f":"IF($F16<5,\"x\",$F16)","v":10.000890885411206},{"$f":"IF($F16<10,\"x\",$F16)","v":10.000890885411206},{"$f":"IF($F16<15,\"x\",$F16)","v":"x"},{"$f":"IF($F16<20,\"x\",$F16)","v":"x"},{"$f":"IF($F16<25,\"x\",$F16)","v":"x"},{"$f":"IF($F16<30,\"x\",$F16)","v":"x"},{"$f":"IF($F16<35,\"x\",$F16)","v":"x"},{"$f":"IF($F16<40,\"x\",$F16)","v":"x"},{"$f":"IF($F16<45,\"x\",$F16)","v":"x"},{"$f":"IF($F16<50,\"x\",$F16)","v":"x"},{"$f":"IF($F16<55,\"x\",$F16)","v":"x"},{"$f":"IF($F16<60,\"x\",$F16)","v":"x"},{"$f":"IF($F16<65,\"x\",$F16)","v":"x"},{"$f":"IF($F16<70,\"x\",$F16)","v":"x"},{"$f":"IF($F16<75,\"x\",$F16)","v":"x"},{"$f":"IF($F16<80,\"x\",$F16)","v":"x"},{"$f":"IF($F16<85,\"x\",$F16)","v":"x"},{"$f":"IF($F16<90,\"x\",$F16)","v":"x"},{"$f":"IF($F16<95,\"x\",$F16)","v":"x"},{"$f":"IF($F16<100,\"x\",$F16)","v":"x"}]
[]
[null,{"$f":"Berechnung!BD7","v":6},{"$f":"Berechnung!BF7","v":"Brückenbau"},null,null,{"$f":"Berechnung!BJ7","v":8.7924884830620993},"%",{"$f":"IF($F18<5,\"x\",$F18)","v":8.7924884830620993},{"$f":"IF($F18<10,\"x\",$F18)","v":"x"},{"$f":"IF($F18<15,\"x\",$F18)","v":"x"},{"$f":"IF($F18<20,\"x\",$F18)","v":"x"},{"$f":"IF($F18<25,\"x\",$F18)","v":"x"},{"$f":"IF($F18<30,\"x\",$F18)","v":"x"},{"$f":"IF($F18<35,\"x\",$F18)","v":"x"},{"$f":"IF($F18<40,\"x\",$F18)","v":"x"},{"$f":"IF($F18<45,\"x\",$F18)","v":"x"},{"$f":"IF($F18<50,\"x\",$F18)","v":"x"},{"$f":"IF($F18<55,\"x\",$F18)","v":"x"},{"$f":"IF($F18<60,\"x\",$F18)","v":"x"},{"$f":"IF($F18<65,\"x\",$F18)","v":"x"},{"$f":"IF($F18<70,\"x\",$F18)","v":"x"},{"$f":"IF($F18<75,\"x\",$F18)","v":"x"},{"$f":"IF($F18<80,\"x\",$F18)","v":"x"},{"$f":"IF($F18<85,\"x\",$F18)","v":"x"},{"$f":"IF($F18<90,\"x\",$F18)","v":"x"},{"$f":"IF($F18<95,\"x\",$F18)","v":"x"},{"$f":"IF($F18<100,\"x\",$F18)","v":"x"}]
[]
[null,{"$f":"Berechnung!BD8","v":7},{"$f":"Berechnung!BF8","v":"Gleis- und Bahnbau"},null,null,{"$f":"Berechnung!BJ8","v":8.6325906376696118},"%",{"$f":"IF($F20<5,\"x\",$F20)","v":8.6325906376696118},{"$f":"IF($F20<10,\"x\",$F20)","v":"x"},{"$f":"IF($F20<15,\"x\",$F20)","v":"x"},{"$f":"IF($F20<20,\"x\",$F20)","v":"x"},{"$f":"IF($F20<25,\"x\",$F20)","v":"x"},{"$f":"IF($F20<30,\"x\",$F20)","v":"x"},{"$f":"IF($F20<35,\"x\",$F20)","v":"x"},{"$f":"IF($F20<40,\"x\",$F20)","v":"x"},{"$f":"IF($F20<45,\"x\",$F20)","v":"x"},{"$f":"IF($F20<50,\"x\",$F20)","v":"x"},{"$f":"IF($F20<55,\"x\",$F20)","v":"x"},{"$f":"IF($F20<60,\"x\",$F20)","v":"x"},{"$f":"IF($F20<65,\"x\",$F20)","v":"x"},{"$f":"IF($F20<70,\"x\",$F20)","v":"x"},{"$f":"IF($F20<75,\"x\",$F20)","v":"x"},{"$f":"IF($F20<80,\"x\",$F20)","v":"x"},{"$f":"IF($F20<85,\"x\",$F20)","v":"x"},{"$f":"IF($F20<90,\"x\",$F20)","v":"x"},{"$f":"IF($F20<95,\"x\",$F20)","v":"x"},{"$f":"IF($F20<100,\"x\",$F20)","v":"x"}]
[]
[null,{"$f":"Berechnung!BD9","v":8},{"$f":"Berechnung!BF9","v":"Statik und Prüfstatik"},null,null,{"$f":"Berechnung!BJ9","v":6.4948726203295504},"%",{"$f":"IF($F22<5,\"x\",$F22)","v":6.4948726203295504},{"$f":"IF($F22<10,\"x\",$F22)","v":"x"},{"$f":"IF($F22<15,\"x\",$F22)","v":"x"},{"$f":"IF($F22<20,\"x\",$F22)","v":"x"},{"$f":"IF($F22<25,\"x\",$F22)","v":"x"},{"$f":"IF($F22<30,\"x\",$F22)","v":"x"},{"$f":"IF($F22<35,\"x\",$F22)","v":"x"},{"$f":"IF($F22<40,\"x\",$F22)","v":"x"},{"$f":"IF($F22<45,\"x\",$F22)","v":"x"},{"$f":"IF($F22<50,\"x\",$F22)","v":"x"},{"$f":"IF($F22<55,\"x\",$F22)","v":"x"},{"$f":"IF($F22<60,\"x\",$F22)","v":"x"},{"$f":"IF($F22<65,\"x\",$F22)","v":"x"},{"$f":"IF($F22<70,\"x\",$F22)","v":"x"},{"$f":"IF($F22<75,\"x\",$F22)","v":"x"},{"$f":"IF($F22<80,\"x\",$F22)","v":"x"},{"$f":"IF($F22<85,\"x\",$F22)","v":"x"},{"$f":"IF($F22<90,\"x\",$F22)","v":"x"},{"$f":"IF($F22<95,\"x\",$F22)","v":"x"},{"$f":"IF($F22<100,\"x\",$F22)","v":"x"}]
[]
[null,{"$f":"Berechnung!BD10","v":9},{"$f":"Berechnung!BF10","v":"Prüfstatiker"},null,null,{"$f":"Berechnung!BJ10","v":6.3599380648240338},"%",{"$f":"IF($F24<5,\"x\",$F24)","v":6.3599380648240338},{"$f":"IF($F24<10,\"x\",$F24)","v":"x"},{"$f":"IF($F24<15,\"x\",$F24)","v":"x"},{"$f":"IF($F24<20,\"x\",$F24)","v":"x"},{"$f":"IF($F24<25,\"x\",$F24)","v":"x"},{"$f":"IF($F24<30,\"x\",$F24)","v":"x"},{"$f":"IF($F24<35,\"x\",$F24)","v":"x"},{"$f":"IF($F24<40,\"x\",$F24)","v":"x"},{"$f":"IF($F24<45,\"x\",$F24)","v":"x"},{"$f":"IF($F24<50,\"x\",$F24)","v":"x"},{"$f":"IF($F24<55,\"x\",$F24)","v":"x"},{"$f":"IF($F24<60,\"x\",$F24)","v":"x"},{"$f":"IF($F24<65,\"x\",$F24)","v":"x"},{"$f":"IF($F24<70,\"x\",$F24)","v":"x"},{"$f":"IF($F24<75,\"x\",$F24)","v":"x"},{"$f":"IF($F24<80,\"x\",$F24)","v":"x"},{"$f":"IF($F24<85,\"x\",$F24)","v":"x"},{"$f":"IF($F24<90,\"x\",$F24)","v":"x"},{"$f":"IF($F24<95,\"x\",$F24)","v":"x"},{"$f":"IF($F24<100,\"x\",$F24)","v":"x"}]
[]
[null,{"$f":"Berechnung!BD11","v":10},{"$f":"Berechnung!BF11","v":"Stadtplanung"},null,null,{"$f":"Berechnung!BJ11","v":3.9601574453934196},"%",{"$f":"IF($F26<5,\"x\",$F26)","v":"x"},{"$f":"IF($F26<10,\"x\",$F26)","v":"x"},{"$f":"IF($F26<15,\"x\",$F26)","v":"x"},{"$f":"IF($F26<20,\"x\",$F26)","v":"x"},{"$f":"IF($F26<25,\"x\",$F26)","v":"x"},{"$f":"IF($F26<30,\"x\",$F26)","v":"x"},{"$f":"IF($F26<35,\"x\",$F26)","v":"x"},{"$f":"IF($F26<40,\"x\",$F26)","v":"x"},{"$f":"IF($F26<45,\"x\",$F26)","v":"x"},{"$f":"IF($F26<50,\"x\",$F26)","v":"x"},{"$f":"IF($F26<55,\"x\",$F26)","v":"x"},{"$f":"IF($F26<60,\"x\",$F26)","v":"x"},{"$f":"IF($F26<65,\"x\",$F26)","v":"x"},{"$f":"IF($F26<70,\"x\",$F26)","v":"x"},{"$f":"IF($F26<75,\"x\",$F26)","v":"x"},{"$f":"IF($F26<80,\"x\",$F26)","v":"x"},{"$f":"IF($F26<85,\"x\",$F26)","v":"x"},{"$f":"IF($F26<90,\"x\",$F26)","v":"x"},{"$f":"IF($F26<95,\"x\",$F26)","v":"x"},{"$f":"IF($F26<100,\"x\",$F26)","v":"x"}]
[]
[null,{"$f":"Berechnung!BD12","v":11},{"$f":"Berechnung!BF12","v":"Bauüberwachung"},null,null,{"$f":"Berechnung!BJ12","v":3.4054218501716971},"%",{"$f":"IF($F28<5,\"x\",$F28)","v":"x"},{"$f":"IF($F28<10,\"x\",$F28)","v":"x"},{"$f":"IF($F28<15,\"x\",$F28)","v":"x"},{"$f":"IF($F28<20,\"x\",$F28)","v":"x"},{"$f":"IF($F28<25,\"x\",$F28)","v":"x"},{"$f":"IF($F28<30,\"x\",$F28)","v":"x"},{"$f":"IF($F28<35,\"x\",$F28)","v":"x"},{"$f":"IF($F28<40,\"x\",$F28)","v":"x"},{"$f":"IF($F28<45,\"x\",$F28)","v":"x"},{"$f":"IF($F28<50,\"x\",$F28)","v":"x"},{"$f":"IF($F28<55,\"x\",$F28)","v":"x"},{"$f":"IF($F28<60,\"x\",$F28)","v":"x"},{"$f":"IF($F28<65,\"x\",$F28)","v":"x"},{"$f":"IF($F28<70,\"x\",$F28)","v":"x"},{"$f":"IF($F28<75,\"x\",$F28)","v":"x"},{"$f":"IF($F28<80,\"x\",$F28)","v":"x"},{"$f":"IF($F28<85,\"x\",$F28)","v":"x"},{"$f":"IF($F28<90,\"x\",$F28)","v":"x"},{"$f":"IF($F28<95,\"x\",$F28)","v":"x"},{"$f":"IF($F28<100,\"x\",$F28)","v":"x"}]
[]
[null,{"$f":"Berechnung!BD13","v":12},{"$f":"Berechnung!BF13","v":"Allg. Genehmigungsplanung"},null,null,{"$f":"Berechnung!BJ13","v":1.2633319683758693},"%","x","x","x","x","x","x","x","x","x","x","x","x","x","x","x","x","x","x","x","x"]
[]
[null,{"$f":"Berechnung!BD14","v":13},{"$f":"Berechnung!BF14","v":"Bauwirtschaft - Bauleitung (Tiefbau)"},null,null,{"$f":"Berechnung!BJ14","v":-2.3029989906181436},"%","x","x","x","x","x","x","x","x","x","x","x","x","x","x","x","x","x","x","x","x"]
[]
[null,{"$f":"Berechnung!BD15","v":14},{"$f":"Berechnung!BF15","v":"Stahlbau"},null,null,{"$f":"Berechnung!BJ15","v":-2.8030159070413951},"%","x","x","x","x","x","x","x","x","x","x","x","x","x","x","x","x","x","x","x","x"]
[]
[null,{"$f":"Berechnung!BD16","v":15},{"$f":"Berechnung!BF16","v":"Bauindustrie - Techn. Außendienst"},null,null,{"$f":"Berechnung!BJ16","v":-3.1362327874057128},"%","x","x","x","x","x","x","x","x","x","x","x","x","x","x","x","x","x","x","x","x"]
[]
[null,{"$f":"Berechnung!BD17","v":16},{"$f":"Berechnung!BF17","v":"Projektentwicklung"},null,null,{"$f":"Berechnung!BJ17","v":-3.981302407775944},"%","x","x","x","x","x","x","x","x","x","x","x","x","x","x","x","x","x","x","x","x"]
[]
[null,{"$f":"Berechnung!BD18","v":17},{"$f":"Berechnung!BF18","v":"Stahlbetonbau"},null,null,{"$f":"Berechnung!BJ18","v":-4.7365119218971463},"%","x","x","x","x","x","x","x","x","x","x","x","x","x","x","x","x","x","x","x","x"]
[]
[null,{"$f":"Berechnung!BD19","v":18},{"$f":"Berechnung!BF19","v":"Spannbetonbau"},null,null,{"$f":"Berechnung!BJ19","v":-5.34741709871982},"%","x","x","x","x","x","x","x","x","x","x","x","x","x","x","x","x","x","x","x","x"]
[]
[null,{"$f":"Berechnung!BD20","v":19},{"$f":"Berechnung!BF20","v":"Vermessung"},null,null,{"$f":"Berechnung!BJ20","v":-6.9070976084177227},"%","x","x","x","x","x","x","x","x","x","x","x","x","x","x","x","x","x","x","x","x"]
[]
[null,{"$f":"Berechnung!BD21","v":20},{"$f":"Berechnung!BF21","v":"Brandschutzplanung"},null,null,{"$f":"Berechnung!BJ21","v":-7.4952422511930683},"%","x","x","x","x","x","x","x","x","x","x","x","x","x","x","x","x","x","x","x","x"]
[]
[null,{"$f":"Berechnung!BD22","v":21},{"$f":"Berechnung!BF22","v":"Bauphysikalische Planung"},null,null,{"$f":"Berechnung!BJ22","v":-8.5166043729981276},"%","x","x","x","x","x","x","x","x","x","x","x","x","x","x","x","x","x","x","x","x"]
[]
[null,{"$f":"Berechnung!BD23","v":22},{"$f":"Berechnung!BF23","v":"Glas-/Aluminiumbau"},null,null,{"$f":"Berechnung!BJ23","v":-9.0188075878236731},"%","x","x","x","x","x","x","x","x","x","x","x","x","x","x","x","x","x","x","x","x"]
[]
[null,{"$f":"Berechnung!BD24","v":23},{"$f":"Berechnung!BF24","v":"Wissenschaftliche Assistenz"},null,null,{"$f":"Berechnung!BJ24","v":-10.67739093227884},"%","x","x","x","x","x","x","x","x","x","x","x","x","x","x","x","x","x","x","x","x"]
[]
[null,{"$f":"Berechnung!BD25","v":24},{"$f":"Berechnung!BF25","v":"Bauindustrie - Herstellung"},null,null,{"$f":"Berechnung!BJ25","v":-11.063269691405031},"%","x","x","x","x","x","x","x","x","x","x","x","x","x","x","x","x","x","x","x","x"]
[]
[null,{"$f":"Berechnung!BD26","v":25},{"$f":"Berechnung!BF26","v":"Sicherheits- und Gesundheitskoordination (SiGeKo)"},null,null,{"$f":"Berechnung!BJ26","v":-12.692229753477324},"%","x","x","x","x","x","x","x","x","x","x","x","x","x","x","x","x","x","x","x","x"]
[]
[null,{"$f":"Berechnung!BD27","v":26},{"$f":"Berechnung!BF27","v":"Denkmalpflege"},null,null,{"$f":"Berechnung!BJ27","v":-12.82016661136236},"%","x","x","x","x","x","x","x","x","x","x","x","x","x","x","x","x","x","x","x","x"]
[]
[null,{"$f":"Berechnung!BD28","v":27},{"$f":"Berechnung!BF28","v":"Projektsteuerung"},null,null,{"$f":"Berechnung!BJ28","v":-12.867660041962692},"%","x","x","x","x","x","x","x","x","x","x","x","x","x","x","x","x","x","x","x","x"]
[]
[null,{"$f":"Berechnung!BD29","v":28},{"$f":"Berechnung!BF29","v":"Sachverständigenwesen"},null,null,{"$f":"Berechnung!BJ29","v":-13.736567887552798},"%","x","x","x","x","x","x","x","x","x","x","x","x","x","x","x","x","x","x","x","x"]
[]
[null,{"$f":"Berechnung!BD30","v":29},{"$f":"Berechnung!BF30","v":"Bauindustrie - Forschung + Entwicklung"},null,null,{"$f":"Berechnung!BJ30","v":-14.496147624400212},"%","x","x","x","x","x","x","x","x","x","x","x","x","x","x","x","x","x","x","x","x"]
[]
[null,{"$f":"Berechnung!BD31","v":30},{"$f":"Berechnung!BF31","v":"Holzbau"},null,null,{"$f":"Berechnung!BJ31","v":-14.821620670889835},"%","x","x","x","x","x","x","x","x","x","x","x","x","x","x","x","x","x","x","x","x"]
[]
[null,{"$f":"Berechnung!BD32","v":31},{"$f":"Berechnung!BF32","v":"Energieberatung"},null,null,{"$f":"Berechnung!BJ32","v":-15.194096320952744},"%","x","x","x","x","x","x","x","x","x","x","x","x","x","x","x","x","x","x","x","x"]
[]
[null,{"$f":"Berechnung!BD33","v":32},{"$f":"Berechnung!BF33","v":"Lehre in der Berufsbildung"},null,null,{"$f":"Berechnung!BJ33","v":-15.292325140647044},"%","x","x","x","x","x","x","x","x","x","x","x","x","x","x","x","x","x","x","x","x"]
[]
[null,{"$f":"Berechnung!BD34","v":33},{"$f":"Berechnung!BF34","v":"Infrastrukturmanagement"},null,null,{"$f":"Berechnung!BJ34","v":-16.713736196452068},"%","x","x","x","x","x","x","x","x","x","x","x","x","x","x","x","x","x","x","x","x"]
[]
[null,{"$f":"Berechnung!BD35","v":34},{"$f":"Berechnung!BF35","v":"Sachbearbeitung Bauordnungsamt"},null,null,{"$f":"Berechnung!BJ35","v":-17.626028385686411},"%","x","x","x","x","x","x","x","x","x","x","x","x","x","x","x","x","x","x","x","x"]
[]
[null,{"$f":"Berechnung!BD36","v":35},{"$f":"Berechnung!BF36","v":"Technische Gebäudeausrüstung (TGA)"},null,null,{"$f":"Berechnung!BJ36","v":-18.238210792284736},"%","x","x","x","x","x","x","x","x","x","x","x","x","x","x","x","x","x","x","x","x"]
[]
[null,{"$f":"Berechnung!BD37","v":36},{"$f":"Berechnung!BF37","v":"Bauwirtschaft - Kalkulation"},null,null,{"$f":"Berechnung!BJ37","v":-20.425175295479136},"%","x","x","x","x","x","x","x","x","x","x","x","x","x","x","x","x","x","x","x","x"]
[]
[null,{"$f":"Berechnung!BD38","v":37},{"$f":"Berechnung!BF38","v":"Ausschreibung und Vergabe"},null,null,{"$f":"Berechnung!BJ38","v":-22.77902280577544},"%","x","x","x","x","x","x","x","x","x","x","x","x","x","x","x","x","x","x","x","x"]
[]
[null,{"$f":"Berechnung!BD39","v":38},{"$f":"Berechnung!BF39","v":"Kostenplanung"},null,null,{"$f":"Berechnung!BJ39","v":-23.534118537520854},"%","x","x","x","x","x","x","x","x","x","x","x","x","x","x","x","x","x","x","x","x"]
[]
[null,{"$f":"Berechnung!BD40","v":39},{"$f":"Berechnung!BF40","v":"Bauwirtschaft - Bauleitung (Hochbau)"},null,null,{"$f":"Berechnung!BJ40","v":-23.93134922476019},"%","x","x","x","x","x","x","x","x","x","x","x","x","x","x","x","x","x","x","x","x"]
[]
[null,{"$f":"Berechnung!BD41","v":40},{"$f":"Berechnung!BF41","v":"Termin- und Kapazitätsplanung"},null,null,{"$f":"Berechnung!BJ41","v":-25.15220311003219},"%","x","x","x","x","x","x","x","x","x","x","x","x","x","x","x","x","x","x","x","x"]
[]
[null,{"$f":"Berechnung!BD42","v":41},{"$f":"Berechnung!BF42","v":"Beleuchtungsplanung"},null,null,{"$f":"Berechnung!BJ42","v":-27.753794018414556},"%","x","x","x","x","x","x","x","x","x","x","x","x","x","x","x","x","x","x","x","x"]

{"sheet":"Modulrelevanz","index":4,"n_rows":101,"n_cols":35,"rows_kept":101,"cut":false,"hidden":false,"merged":[]}
[]
[null,"Berufsbild","Baukonstruktion / CAD (B 101, B 201)","Baustoffkunde / Bauchemie (B 102)","Technische Mechanik / Baustatik (B 103, B 203)","Mathematik (B 104, B 205)","Bauphysik (B 105, B 206)","Vermessungswesen (B 202)","Baubetrieb / Bauwirtschaft 1 (B 203)","Massivbau/Stahlbetonbau (B 301, B 401, B 605)","Holzbau (B 302, B 402)","Wasserbau / Wasserwirtschaft (B 303, B 403)","Baubetrieb / Bauwirtschaft 2-4 (B 304, 404, 704)","Baustatik / Informatik (FEM) (B 305, B 405)","Ingenieurgeologie und Bodenmechanik (B 306)","Stahlbau (B 307, B 407)","Grundbau (B 406)","Verkehrsbau (B 601, B 701)","Wasserbau und Geotechnik (B 602, B 702)","Brandschutzbemessung (B 606)","Technische Gebäudeausrüstung (B 607)","Bausanierung (B 705)"]
[null,"Ausschreibung und Vergabe"]
[null,"Bauleitung"]
[null,"Kalkulation"]
[null,"Baudynamik"]
[null,"Bauindustrie - Forschung + Entwicklung"]
[null,"Bauindustrie - Herstellung"]
[null,"Bauindustrie - Techn. Außendienst"]
[null,"Bauphysikalische Planung"]
[null,"Bauüberwachung"]
[null,"Beleuchtungsplanung"]
[null,"Brandschutzplanung (A+B)"]
[null,"Brückenbau"]
[null,"Denkmalpflege"]
[null,"Energieberatung"]
[null,"Genehmigungsplanung"]
[null,"Geotechnik"]
[null,"Glas-/Aluminiumbau"]
[null,"Gleis- und Bahnbau"]
[null,"Holzbau"]
[null,"Infrastrukturmanagement"]
[null,"Kostenplanung"]
[null,"Lehre in der Weiterbildung"]
[null,"Projektentwicklung"]
[null,"Projektsteuerung und -management"]
[null,"Sachbearbeitung im Bauordnungsamt"]
[null,"Sachverständigenwesen"]
[null,"Sicherheits- und Gesundheitskoordination"]
[null,"Softwareentwicklung im Baubereich"]
[null,"Spannbetonbau"]
[null,"Stadtplanung"]
[null,"Stahlbau"]
[null,"Statik und Prüfstatik"]
[null,"Technische Gebäudeausrüstung (TGA)"]
[null,"Termin- und Kapazitätsplanung"]
[null,"Tunnelbau"]
[null,"Vermessung"]
[null,"Wasserbau"]
[null,"Wissenschaftliche Assistenz"]
[]
[null,"Legende",null,"sehr berufsrelevant",null,null,null,null,null,null,"berufsrelevant",null,null,null,null,null,"bedingt berufsrelevant"]
[]
[]
[]
[]
[]
[]
[]
[]
[]
[]
[]
[]
[]
[]
[null,null,null,null,null,null,null,null,null,null,null,null,null,null,null,null,null,null,null,null,null,null,null,null,"Praxissemester, Wahlpflichtbereich und Bachelorarbeit sind in jedem Fall sehr relevant "]
[]
[]
[]
[]
[]
[]
[null,null,null,null,null,null,null,null,null,null,null,null,null,null,null,null,null,null,null,null,null,null,null,null,"Alle Fächer",null,null,null,null,"Zusammenfassung"]
[null,null,null,null,null,null,null,null,null,null,null,null,null,null,null,null,null,null,null,null,null,null,null,null,"B 101","Baukonstruktion / CAD 1 ",null,null,null,"B 101, B 201","Baukonstruktion / CAD",null,null,null,"Baukonstruktion / CAD (B 101, B 201)"]
[null,null,null,null,null,null,null,null,null,null,null,null,null,null,null,null,null,null,null,null,null,null,null,null,"B 102","Baustoffkunde / Bauchemie ",null,null,null,"B 102","Baustoffkunde / Bauchemie ",null,null,null,"Baustoffkunde / Bauchemie (B 102)"]
[null,null,null,null,null,null,null,null,null,null,null,null,null,null,null,null,null,null,null,null,null,null,null,null,"B 103","Technische Mechanik / Baustatik 1 ",null,null,null,"B 103, B 203","Technische Mechanik / Baustatik",null,null,null,"Technische Mechanik / Baustatik (B 103, B 203)"]
[null,null,null,null,null,null,null,null,null,null,null,null,null,null,null,null,null,null,null,null,null,null,null,null,"B 104","Mathematik 1",null,null,null,"B 104, B 205","Mathematik",null,null,null,"Mathematik (B 104, B 205)"]
[null,null,null,null,null,null,null,null,null,null,null,null,null,null,null,null,null,null,null,null,null,null,null,null,"B 105","Bauphysik 1",null,null,null,"B 105, B 206","Bauphysik",null,null,null,"Bauphysik (B 105, B 206)"]
[null,null,null,null,null,null,null,null,null,null,null,null,null,null,null,null,null,null,null,null,null,null,null,null,null,null,null,null,null,"B 202","Vermessungswesen",null,null,null,"Vermessungswesen (B 202)"]
[null,null,null,null,null,null,null,null,null,null,null,null,null,null,null,null,null,null,null,null,null,null,null,null,"B 201","Baukonstruktion / CAD 2",null,null,null,"B 203","Baubetrieb / Bauwirtschaft 1",null,null,null,"Baubetrieb / Bauwirtschaft 1 (B 203)"]
[null,null,null,null,null,null,null,null,null,null,null,null,null,null,null,null,null,null,null,null,null,null,null,null,"B 202","Vermessungswesen"]
[null,null,null,null,null,null,null,null,null,null,null,null,null,null,null,null,null,null,null,null,null,null,null,null,"B 203","Baubetrieb / Bauwirtschaft 1 ",null,null,null,null,null,null,null,null,"Massivbau/Stahlbetonbau (B 301, B 401, B 605)"]
[null,null,null,null,null,null,null,null,null,null,null,null,null,null,null,null,null,null,null,null,null,null,null,null,"B 204","Technische Mechanik / Baustatik 2",null,null,null,"B 301, B 401, B 605","Massivbau",null,null,null,"Holzbau (B 302, B 402)"]
[null,null,null,null,null,null,null,null,null,null,null,null,null,null,null,null,null,null,null,null,null,null,null,null,"B 205","Mathematik 2",null,null,null,"B 302, B 402","Holzbau",null,null,null,"Wasserbau / Wasserwirtschaft (B 303, B 403)"]
[null,null,null,null,null,null,null,null,null,null,null,null,null,null,null,null,null,null,null,null,null,null,null,null,"B 206","Bauphysik 2",null,null,null,"B 303, B 403","Wasserbau / Wasserwirtschaft",null,null,null,"Baubetrieb / Bauwirtschaft 2-4 (B 304, 404, 704)"]
[null,null,null,null,null,null,null,null,null,null,null,null,null,null,null,null,null,null,null,null,null,null,null,null,"B 301","Massivbau 1",null,null,null,"B 304, 404, 704","Baubetrieb / Bauwirtschaft 2+4",null,null,null,"Baustatik / Informatik (FEM) (B 305, B 405)"]
[null,null,null,null,null,null,null,null,null,null,null,null,null,null,null,null,null,null,null,null,null,null,null,null,"B 302, B 402","Holzbau",null,null,null,"B 305, B 405","Baustatik / Informatik (FEM)",null,null,null,"Ingenieurgeologie und Bodenmechanik (B 306)"]
[null,null,null,null,null,null,null,null,null,null,null,null,null,null,null,null,null,null,null,null,null,null,null,null,"B 303, B 403","Wasserbau / Wasserwirtschaft",null,null,null,null,null,null,null,null,"Stahlbau (B 307, B 407)"]
[null,null,null,null,null,null,null,null,null,null,null,null,null,null,null,null,null,null,null,null,null,null,null,null,null,null,null,null,null,"B 306","Ingenieurgeologie und Bodenmechanik"]
[null,null,null,null,null,null,null,null,null,null,null,null,null,null,null,null,null,null,null,null,null,null,null,null,"B 304","Baubetrieb / Bauwirtschaft 2",null,null,null,"B 307, B 407","Stahlbau",null,null,null,"Grundbau (B 406)"]
[null,null,null,null,null,null,null,null,null,null,null,null,null,null,null,null,null,null,null,null,null,null,null,null,"B 305","Baustatik / Informatik (FEM) 1",null,null,null,null,null,null,null,null,"Verkehrsbau (B 601, B 701)"]
[null,null,null,null,null,null,null,null,null,null,null,null,null,null,null,null,null,null,null,null,null,null,null,null,"B 306","Ingenieurgeologie und Bodenmechanik",null,null,null,null,null,null,null,null,"Wasserbau und Geotechnik (B 602, B 702)"]
[null,null,null,null,null,null,null,null,null,null,null,null,null,null,null,null,null,null,null,null,null,null,null,null,"B 307","Stahlbau 1",null,null,null,"B 406","Grundbau",null,null,null,"Projektstudium (B 604)"]
[null,null,null,null,null,null,null,null,null,null,null,null,null,null,null,null,null,null,null,null,null,null,null,null,"B 401","Massivbau 2",null,null,null,null,null,null,null,null,"Brandschutzbemessung (B 606)"]
[null,null,null,null,null,null,null,null,null,null,null,null,null,null,null,null,null,null,null,null,null,null,null,null,"B 404","Baubetrieb / Bauwirtschaft 3",null,null,null,"B 601, B 701","Verkehrsbau",null,null,null,"Technische Gebäudeausrüstung (B 607)"]
[null,null,null,null,null,null,null,null,null,null,null,null,null,null,null,null,null,null,null,null,null,null,null,null,"B 405","Baustatik / Informatik (FEM) 2",null,null,null,"B 602, B 702","Wasserbau und Geotechnik",null,null,null,"Bausanierung (B 705)"]
[null,null,null,null,null,null,null,null,null,null,null,null,null,null,null,null,null,null,null,null,null,null,null,null,"B 406","Grundbau"]
[null,null,null,null,null,null,null,null,null,null,null,null,null,null,null,null,null,null,null,null,null,null,null,null,"B 407","Stahlbau 2",null,null,null,"B 604","Projektstudium"]
[]
[null,null,null,null,null,null,null,null,null,null,null,null,null,null,null,null,null,null,null,null,null,null,null,null,"B 501","Praxissemester",null,null,null,"B 606","Brandschutzbemessung"]
[null,null,null,null,null,null,null,null,null,null,null,null,null,null,null,null,null,null,null,null,null,null,null,null,"B 601","Verkehrsbau 1",null,null,null,"B 607","Technische Gebäudeausrüstung"]
[null,null,null,null,null,null,null,null,null,null,null,null,null,null,null,null,null,null,null,null,null,null,null,null,"B 602, B 702","Wasserbau und Geotechnik"]
[null,null,null,null,null,null,null,null,null,null,null,null,null,null,null,null,null,null,null,null,null,null,null,null,"B 603, B 703","Wahlpflicht",null,null,null,"B 705","Bausanierung"]
[null,null,null,null,null,null,null,null,null,null,null,null,null,null,null,null,null,null,null,null,null,null,null,null,"B 604","Projektstudium"]
[null,null,null,null,null,null,null,null,null,null,null,null,null,null,null,null,null,null,null,null,null,null,null,null,"B 605","Massivbau 3"]
[null,null,null,null,null,null,null,null,null,null,null,null,null,null,null,null,null,null,null,null,null,null,null,null,"B 606","Brandschutzbemessung"]
[null,null,null,null,null,null,null,null,null,null,null,null,null,null,null,null,null,null,null,null,null,null,null,null,"B 607","Technische Gebäudeausrüstung"]
[null,null,null,null,null,null,null,null,null,null,null,null,null,null,null,null,null,null,null,null,null,null,null,null,"B 701","Verkehrsbau 2"]
[null,null,null,null,null,null,null,null,null,null,null,null,null,null,null,null,null,null,null,null,null,null,null,null,"B 704","Baubetrieb / Bauwirtschaft  4"]
[null,null,null,null,null,null,null,null,null,null,null,null,null,null,null,null,null,null,null,null,null,null,null,null,"B 705","Bausanierung"]